Reaction Details
Target5-hydroxytryptamine receptor 6
LigandBDBM50073056
Substrate/Competitorn/a
Meas. Tech.ChEMBL_302832 (CHEMBL838622)
Ki 5±n/a nM
Citation Lee, MRangisetty, JBPullagurla, MRDukat, MSetola, VRoth, BLGlennon, RA 1-(1-Naphthyl)piperazine as a novel template for 5-HT6 serotonin receptor ligands. Bioorg Med Chem Lett15:1707-11 (2005) 
 
5-hydroxytryptamine receptor 6
Name:5-hydroxytryptamine receptor 6
Type:G Protein-Coupled Receptor (GPCR)
Mol. Mass.:46968.43
Organism:Homo sapiens (Human)
Description:P50406
Residue:440
BDBM50073056
NameBDBM50073056
Synonyms:4-Bromo-N-[4-methoxy-3-(4-methyl-piperazin-1-yl)-phenyl]-benzenesulfonamide SB-214111
TypeSmall organic molecule
Emp. Form.C18H22BrN3O3S
Mol. Mass.440.355
SMILESCOc1ccc(NS(=O)(=O)c2ccc(Br)cc2)cc1N1CCN(C)CC1