Reaction Details
TargetProstaglandin G/H synthase 2
LigandBDBM50163744
Substrate/Competitorn/a
Meas. Tech.ChEMBL_311665 (CHEMBL825457)
IC50 21360±n/a nM
Citation Selvam, CJachak, SMThilagavathi, RChakraborti, AK Design, synthesis, biological evaluation and molecular docking of curcumin analogues as antioxidant, cyclooxygenase inhibitory and anti-inflammatory agents. Bioorg Med Chem Lett15:1793-7 (2005) 
 
Prostaglandin G/H synthase 2
Name:Prostaglandin G/H synthase 2
Type:Enzyme
Mol. Mass.:69003.89
Organism:Homo sapiens (Human)
Description:Recombinant Cox-2 provided by Cayman (Cayman Chemical Co.,Ann Arbor, MI).
Residue:604
BDBM50163744
NameBDBM50163744
Synonyms:(1E,4Z,6E)-5-Hydroxy-1-(4-hydroxy-3-methoxy-phenyl)-7-(4-hydroxy-phenyl)-hepta-1,4,6-trien-3-one 1-(4-hydroxy-3-methoxyphenyl)-7-(4-hydroxyphenyl)-1,6-heptadiene-3,5-dione CHEMBL179512 curcumin II | demethoxycurcumin
TypeSmall organic molecule
Emp. Form.C20H18O5
Mol. Mass.338.3539
SMILESCOc1cc(C=CC(=O)CC(=O)C=Cc2ccc(O)cc2)ccc1O