Reaction Details
TargetProstaglandin G/H synthase 2
LigandBDBM50163748
Substrate/Competitorn/a
Meas. Tech.ChEMBL_311665 (CHEMBL825457)
IC50 9700±n/a nM
Citation Selvam, CJachak, SMThilagavathi, RChakraborti, AK Design, synthesis, biological evaluation and molecular docking of curcumin analogues as antioxidant, cyclooxygenase inhibitory and anti-inflammatory agents. Bioorg Med Chem Lett15:1793-7 (2005) 
 
Prostaglandin G/H synthase 2
Name:Prostaglandin G/H synthase 2
Type:Enzyme
Mol. Mass.:69003.89
Organism:Homo sapiens (Human)
Description:Recombinant Cox-2 provided by Cayman (Cayman Chemical Co.,Ann Arbor, MI).
Residue:604
BDBM50163748
NameBDBM50163748
Synonyms:(E)-3,5-Bis[beta-(4-Hydroxy-3-methoxyphenyl)-ethenyl]-1H-pyrazole 4,40-(1E,10E)-2,20-(1-H-Pyrazole-3,5-diyl)bis(ethene-2,1-diyl)bis(2-methoxyphenol) 4-(2-(5-(4-hydroxy-3-methoxystyryl)-1H-pyrazol-3-yl)vinyl)-2-methoxyphenol | CHEMBL180239
TypeSmall organic molecule
Emp. Form.C21H20N2O4
Mol. Mass.364.3945
SMILESCOc1cc(\C=C\c2cc(\C=C\c3ccc(O)c(OC)c3)[nH]n2)ccc1O