Reaction Details
TargetNeuronal acetylcholine receptor subunit alpha-7
LigandBDBM50164912
Substrate/Competitorn/a
Meas. Tech.ChEMBL_303552 (CHEMBL828952)
Ki 29±n/a nM
Citation Mazurov, AKlucik, JMiao, LPhillips, TYSeamans, ASchmitt, JDHauser, TAJohnson, RTMiller, C 2-(Arylmethyl)-3-substituted quinuclidines as selective alpha 7 nicotinic receptor ligands. Bioorg Med Chem Lett15:2073-7 (2005) 
 
Neuronal acetylcholine receptor subunit alpha-7
Name:Neuronal acetylcholine receptor subunit alpha-7
Type:Enzyme
Mol. Mass.:56502.44
Organism:Rattus norvegicus (Rat)
Description:Q05941
Residue:502
BDBM50164912
NameBDBM50164912
Synonyms:(4-Bromo-phenyl)-carbamic acid (2R,3R)-2-(4-methoxy-pyridin-3-ylmethyl)-1-aza-bicyclo[2.2.2]oct-3-yl ester | CHEMBL195592
TypeSmall organic molecule
Emp. Form.C21H24BrN3O3
Mol. Mass.446.338
SMILESCOc1ccncc1C[C@@H]1[C@H](OC(=O)Nc2ccc(Br)cc2)C2CCN1CC2