Reaction Details
TargetNeuronal acetylcholine receptor subunit alpha-7
LigandBDBM50164938
Substrate/Competitorn/a
Meas. Tech.ChEMBL_303552 (CHEMBL828952)
Ki 38±n/a nM
Citation Mazurov, AKlucik, JMiao, LPhillips, TYSeamans, ASchmitt, JDHauser, TAJohnson, RTMiller, C 2-(Arylmethyl)-3-substituted quinuclidines as selective alpha 7 nicotinic receptor ligands. Bioorg Med Chem Lett15:2073-7 (2005) 
 
Neuronal acetylcholine receptor subunit alpha-7
Name:Neuronal acetylcholine receptor subunit alpha-7
Type:Enzyme
Mol. Mass.:56502.44
Organism:Rattus norvegicus (Rat)
Description:Q05941
Residue:502
BDBM50164938
NameBDBM50164938
Synonyms:1-(4-Dimethylamino-phenyl)-3-((2R,3R)-2-pyridin-3-ylmethyl-1-aza-bicyclo[2.2.2]oct-3-yl)-urea | CHEMBL193579
TypeSmall organic molecule
Emp. Form.C22H29N5O
Mol. Mass.379.4986
SMILESCN(C)c1ccc(NC(=O)N[C@@H]2C3CCN(CC3)[C@@H]2Cc2cccnc2)cc1