Reaction Details
TargetNeuronal acetylcholine receptor subunit alpha-7
LigandBDBM50164929
Substrate/Competitorn/a
Meas. Tech.ChEMBL_303552 (CHEMBL828952)
Ki 50±n/a nM
Citation Mazurov, AKlucik, JMiao, LPhillips, TYSeamans, ASchmitt, JDHauser, TAJohnson, RTMiller, C 2-(Arylmethyl)-3-substituted quinuclidines as selective alpha 7 nicotinic receptor ligands. Bioorg Med Chem Lett15:2073-7 (2005) 
 
Neuronal acetylcholine receptor subunit alpha-7
Name:Neuronal acetylcholine receptor subunit alpha-7
Type:Enzyme
Mol. Mass.:56502.44
Organism:Rattus norvegicus (Rat)
Description:Q05941
Residue:502
BDBM50164929
NameBDBM50164929
Synonyms:(4-Phenoxy-phenyl)-carbamic acid (2R,3R)-2-pyridin-3-ylmethyl-1-aza-bicyclo[2.2.2]oct-3-yl ester | CHEMBL193483
TypeSmall organic molecule
Emp. Form.C26H27N3O3
Mol. Mass.429.5109
SMILESO=C(Nc1ccc(Oc2ccccc2)cc1)O[C@@H]1C2CCN(CC2)[C@@H]1Cc1cccnc1