Reaction Details
TargetKappa-type opioid receptor
LigandBDBM50128411
Substrate/Competitorn/a
Meas. Tech.ChEMBL_303170 (CHEMBL829981)
Ki 11±n/a nM
Citation Wentland, MPLu, QLou, RBu, YKnapp, BIBidlack, JM Synthesis and opioid receptor binding properties of a highly potent 4-hydroxy analogue of naltrexone. Bioorg Med Chem Lett15:2107-10 (2005) 
 
Kappa-type opioid receptor
Name:Kappa-type opioid receptor
Type:G Protein-Coupled Receptor (GPCR)
Mol. Mass.:42648.76
Organism:Homo sapiens (Human)
Description:P41145
Residue:380
BDBM50128411
NameBDBM50128411
Synonyms:3-desoxy-3-carboxamidonaltrexone CHEMBL56695
TypeSmall organic molecule
Emp. Form.C21H24N2O4
Mol. Mass.368.4263
SMILESNC(=O)c1ccc2C[C@H]3N(CC4CC4)CC[C@@]45[C@@H](Oc1c24)C(=O)CC[C@@]35O