Reaction Details
TargetGeranylgeranyl transferase type-1 subunit beta/Protein farnesyltransferase/geranylgeranyltransferase type-1 subunit alpha
LigandBDBM50150666
Substrate/Competitorn/a
Meas. Tech.ChEMBL_306136 (CHEMBL831371)
IC50>1000000±n/a nM
Citation El Oualid, FBurm, BELeroy, IMCohen, LHvan Boom, JHvan den Elst, HOverkleeft, HSvan der Marel, GAOverhand, M Design, synthesis, and evaluation of sugar amino acid based inhibitors of protein prenyl transferases PFT and PGGT-1. J Med Chem47:3920-3 (2004) 
 
Geranylgeranyl transferase type-1 subunit beta/Protein farnesyltransferase/geranylgeranyltransferase type-1 subunit alpha
Name:Geranylgeranyl transferase type-1 subunit beta/Protein farnesyltransferase/geranylgeranyltransferase type-1 subunit alpha
Type:n/a
Mol. Mass.:n/a
Description:ASSAY_ID of EBI is 70196
Components:This complex has 2 components.
Component 1
Name:Protein farnesyltransferase/geranylgeranyltransferase type-1 subunit alpha
Synonyms:CAAX farnesyltransferase alpha subunit FNTA_HUMAN FTase-alpha Geranylgeranyl Transferase (GGTase-I) Chain A Protein Farnesyltransferase (PFT) Chain A Protein farnesyltransferase Protein farnesyltransferase/geranylgeranyltransferase type I alpha subunit | Ras proteins prenyltransferase alpha
Type:Enzyme
Mol. Mass.:44392.46
Organism:Homo sapiens (Human)
Description:Recombinant human FTase.
Residue:379
Component 2
Name:Geranylgeranyl transferase type-1 subunit beta
Synonyms:2.5.1.59 Geranylgeranyl transferase type I Geranylgeranyl transferase type I subunit beta PGGT1B Protein farnesyl/geranylgeranyl transferase | Type I protein geranyl-geranyltransferase subunit beta
Type:n/a
Mol. Mass.:42369.84
Organism:Homo sapiens (Human)
Description:n/a
Residue:377
BDBM50150666
NameBDBM50150666
Synonyms:(S)-2-({(2S,3S,6R)-6-[((R)-2-Amino-3-tert-butyldisulfanyl-propionylamino)-methyl]-3-benzyloxy-tetrahydro-pyran-2-carbonyl}-amino)-4-methanesulfinyl-butyric acid | CHEMBL185816
TypeSmall organic molecule
Emp. Form.C26H41N3O7S3
Mol. Mass.603.815
SMILESCS(=O)CC[C@H](NC(=O)[C@H]1O[C@@H](CNC(=O)[C@@H](N)CSSC(C)(C)C)CC[C@@H]1OCc1ccccc1)C(O)=O