Reaction Details
TargetAdenosine receptor A2a
LigandBDBM50150762
Substrate/Competitorn/a
Meas. Tech.ChEMBL_310583 (CHEMBL834239)
EC50 1.4±n/a nM
Citation Bosch, MPCampos, FNiubó, IRosell, GDíaz, JLBrea, JLoza, MIGuerrero, A Synthesis and biological activity of new potential agonists for the human adenosine A2A receptor. J Med Chem47:4041-53 (2004) 
 
Adenosine receptor A2a
Name:Adenosine receptor A2a
Type:G Protein-Coupled Receptor (GPCR)
Mol. Mass.:44716.46
Organism:Homo sapiens (Human)
Description:P29274
Residue:412
BDBM50150762
NameBDBM50150762
Synonyms:(2R,3R,4S,5R)-2-{6-Amino-2-[(S)-1-hydroxymethyl-2-(4-methoxy-phenyl)-ethylamino]-purin-9-yl}-5-(2-ethyl-2H-tetrazol-5-yl)-tetrahydro-furan-3,4-diol | CHEMBL368880
TypeSmall organic molecule
Emp. Form.C22H28N10O5
Mol. Mass.512.5217
SMILESCCn1nnc(n1)[C@H]1O[C@H]([C@H](O)[C@@H]1O)n1cnc2c(N)nc(N[C@H](CO)Cc3ccc(OC)cc3)nc12