Reaction Details
TargetKappa-type opioid receptor
LigandBDBM50154199
Substrate/Competitorn/a
Meas. Tech.ChEMBL_303480 (CHEMBL838854)
Ki 146±n/a nM
Citation Grundt, PWilliams, IALewis, JWHusbands, SM Identification of a new scaffold for opioid receptor antagonism based on the 2-amino-1,1-dimethyl-7-hydroxytetralin pharmacophore. J Med Chem47:5069-75 (2004) 
 
Kappa-type opioid receptor
Name:Kappa-type opioid receptor
Type:G Protein-Coupled Receptor (GPCR)
Mol. Mass.:42648.76
Organism:Homo sapiens (Human)
Description:P41145
Residue:380
BDBM50154199
NameBDBM50154199
Synonyms:7-[(cyclopropylmethyl)(methyl)amino]-8,8-dimethyl-5,6,7,8-tetrahydronaphthalen-2-ol | CHEMBL365228
TypeSmall organic molecule
Emp. Form.C17H25NO
Mol. Mass.259.3865
SMILESCN(CC1CC1)C1CCc2ccc(O)cc2C1(C)C