Reaction Details
TargetMu-type opioid receptor
LigandBDBM50154209
Substrate/Competitorn/a
Meas. Tech.ChEMBL_303422 (CHEMBL840085)
Ki 40±n/a nM
Citation Grundt, PWilliams, IALewis, JWHusbands, SM Identification of a new scaffold for opioid receptor antagonism based on the 2-amino-1,1-dimethyl-7-hydroxytetralin pharmacophore. J Med Chem47:5069-75 (2004) 
 
Mu-type opioid receptor
Name:Mu-type opioid receptor
Type:G Protein-Coupled Receptor (GPCR)
Mol. Mass.:44789.51
Organism:Homo sapiens (Human)
Description:P35372
Residue:400
BDBM50154209
NameBDBM50154209
Synonyms:8,8-Dimethyl-7-[methyl-((E)-3-phenyl-allyl)-amino]-5,6,7,8-tetrahydro-naphthalen-2-ol | CHEMBL365483
TypeSmall organic molecule
Emp. Form.C22H27NO
Mol. Mass.321.4559
SMILESCN(C\C=C\c1ccccc1)C1CCc2ccc(O)cc2C1(C)C