Reaction Details
TargetKappa-type opioid receptor
LigandBDBM50154201
Substrate/Competitorn/a
Meas. Tech.ChEMBL_303480 (CHEMBL838854)
Ki 232±n/a nM
Citation Grundt, PWilliams, IALewis, JWHusbands, SM Identification of a new scaffold for opioid receptor antagonism based on the 2-amino-1,1-dimethyl-7-hydroxytetralin pharmacophore. J Med Chem47:5069-75 (2004) 
 
Kappa-type opioid receptor
Name:Kappa-type opioid receptor
Type:G Protein-Coupled Receptor (GPCR)
Mol. Mass.:42648.76
Organism:Homo sapiens (Human)
Description:P41145
Residue:380
BDBM50154201
NameBDBM50154201
Synonyms:7-[(cyclopropylmethyl)amino]-8,8-dimethyl-5,6,7,8-tetrahydronaphthalen-2-ol | CHEMBL188920
TypeSmall organic molecule
Emp. Form.C16H23NO
Mol. Mass.245.3599
SMILESCC1(C)C(CCc2ccc(O)cc12)NCC1CC1