Reaction Details
TargetMu-type opioid receptor
LigandBDBM50154296
Substrate/Competitorn/a
Meas. Tech.ChEMBL_303268 (CHEMBL828262)
Ki 6600±n/a nM
Citation Cardillo, GGentilucci, LTolomelli, ASpinosa, RCalienni, MQasem, ARSpampinato, S Synthesis and evaluation of the affinity toward mu-opioid receptors of atypical, lipophilic ligands based on the sequence c[-Tyr-Pro-Trp-Phe-Gly-]. J Med Chem47:5198-203 (2004) 
 
Mu-type opioid receptor
Name:Mu-type opioid receptor
Type:G Protein-Coupled Receptor (GPCR)
Mol. Mass.:44503.11
Organism:Rattus norvegicus (rat)
Description:Competition binding assays were carried out using membrane preparations from transfected HN9.10 cells that constitutively expressed the mu opioid receptor.
Residue:398
BDBM50154296
NameBDBM50154296
Synonyms:CHEMBL434545 | [(5R,9R,12S,14aR)-9-Benzyl-5-(4-hydroxy-benzyl)-12-(1H-indol-3-ylmethyl)-4,8,11,14-tetraoxo-dodecahydro-3a,6,7,10,13-pentaaza-cyclopentacyclotridecen-7-yl]-acetic acid
TypeSmall organic molecule
Emp. Form.C36H38N6O7
Mol. Mass.666.7229
SMILESOC(=O)CN1N[C@H](Cc2ccc(O)cc2)C(=O)N2CCC[C@@H]2C(=O)N[C@@H](Cc2c[nH]c3ccccc23)C(=O)N[C@H](Cc2ccccc2)C1=O