Reaction Details
TargetCytochrome P450 2D6
LigandBDBM67690
Substrate/Competitorn/a
Meas. Tech.ChEMBL_304713 (CHEMBL827154)
IC50 76300±n/a nM
Citation Kemp, CAFlanagan, JUvan Eldik, AJMaréchal, JDWolf, CRRoberts, GCPaine, MJSutcliffe, MJ Validation of model of cytochrome P450 2D6: an in silico tool for predicting metabolism and inhibition. J Med Chem47:5340-6 (2004) 
 
Cytochrome P450 2D6
Name:Cytochrome P450 2D6
Type:Protein
Mol. Mass.:55774.82
Organism:Homo sapiens (Human)
Description:P10635
Residue:497
BDBM67690
NameBDBM67690
Synonyms:1,4-bis[2-(2-hydroxyethylamino)ethylamino]-5,8-bis(oxidanyl)anthracene-9,10-dione;hydrochloride 1,4-dihydroxy-5,8-bis[2-(2-hydroxyethylamino)ethylamino]anthracene-9,10-dione;hydrochloride MITOXANTRONE MLS001333711 cid_4212 | cid_5458171
TypeSmall organic molecule
Emp. Form.C22H28N4O6
Mol. Mass.444.4809
SMILESOCCNCCNc1ccc(NCCNCCO)c2C(=O)c3c(O)ccc(O)c3C(=O)c12