Reaction Details
TargetMO15-related protein kinase Pfmrk
LigandBDBM7458
Substrate/Competitorn/a
Meas. Tech.ChEMBL_306159 (CHEMBL832347)
IC50 7000±n/a nM
Citation Bhattacharjee, AKGeyer, JAWoodard, CLKathcart, AKNichols, DAPrigge, STLi, ZMott, BTWaters, NC A three-dimensional in silico pharmacophore model for inhibition of Plasmodium falciparum cyclin-dependent kinases and discovery of different classes of novel Pfmrk specific inhibitors. J Med Chem47:5418-26 (2004) 
 
MO15-related protein kinase Pfmrk
Name:MO15-related protein kinase Pfmrk
Synonyms:Protein kinase Pfmrk
Type:PROTEIN
Mol. Mass.:37992.30
Organism:Plasmodium falciparum
Description:ChEMBL_640752
Residue:324
BDBM7458
NameBDBM7458
TypeSmall organic molecule
Emp. Form.C15H10O5
Mol. Mass.270.2369
SMILESOc1ccc(cc1)-c1cc(=O)c2c(O)cc(O)cc2o1