Reaction Details
TargetMO15-related protein kinase Pfmrk
LigandBDBM15236
Substrate/Competitorn/a
Meas. Tech.ChEMBL_306159 (CHEMBL832347)
IC50 157000±n/a nM
Citation Bhattacharjee, AKGeyer, JAWoodard, CLKathcart, AKNichols, DAPrigge, STLi, ZMott, BTWaters, NC A three-dimensional in silico pharmacophore model for inhibition of Plasmodium falciparum cyclin-dependent kinases and discovery of different classes of novel Pfmrk specific inhibitors. J Med Chem47:5418-26 (2004) 
 
MO15-related protein kinase Pfmrk
Name:MO15-related protein kinase Pfmrk
Synonyms:Protein kinase Pfmrk
Type:PROTEIN
Mol. Mass.:37992.30
Organism:Plasmodium falciparum
Description:ChEMBL_640752
Residue:324
BDBM15236
NameBDBM15236
TypeSmall organic molecule
Emp. Form.C15H10O8
Mol. Mass.318.2351
SMILESOc1cc(O)c2c(c1)oc(-c1cc(O)c(O)c(O)c1)c(O)c2=O