Reaction Details
TargetMO15-related protein kinase Pfmrk
LigandBDBM50059889
Substrate/Competitorn/a
Meas. Tech.ChEMBL_306159 (CHEMBL832347)
IC50 4000±n/a nM
Citation Bhattacharjee, AKGeyer, JAWoodard, CLKathcart, AKNichols, DAPrigge, STLi, ZMott, BTWaters, NC A three-dimensional in silico pharmacophore model for inhibition of Plasmodium falciparum cyclin-dependent kinases and discovery of different classes of novel Pfmrk specific inhibitors. J Med Chem47:5418-26 (2004) 
 
MO15-related protein kinase Pfmrk
Name:MO15-related protein kinase Pfmrk
Synonyms:Protein kinase Pfmrk
Type:PROTEIN
Mol. Mass.:37992.30
Organism:Plasmodium falciparum
Description:ChEMBL_640752
Residue:324
BDBM50059889
NameBDBM50059889
TypeSmall organic molecule
Emp. Form.C28H26N4O3
Mol. Mass.466.531
SMILESCN[C@@H]1CC2O[C@@](C)([C@@H]1OC)n1c3ccccc3c3c4CNC(=O)c4c4c5ccccc5n2c4c13