Reaction Details
TargetGag-Pol polyprotein [489-587]
LigandBDBM50156141
Substrate/Competitorn/a
Meas. Tech.ChEMBL_302137 (CHEMBL841761)
Kd 21.1±n/a nM
Citation Shuman, CFVrang, LDanielson, UH Improved structure-activity relationship analysis of HIV-1 protease inhibitors using interaction kinetic data. J Med Chem47:5953-61 (2004) 
 
Gag-Pol polyprotein [489-587]
Name:Gag-Pol polyprotein [489-587]
Type:Enzyme Subunit
Mol. Mass.:10781.16
Organism:Human immunodeficiency virus type 1
Description:P04585[489-587]
Residue:99
BDBM50156141
NameBDBM50156141
Synonyms:5-(4-Bromo-phenoxy)-1,6-bis-(2,3-dimethyl-butyrylamino)-3,4-dihydroxy-1,6-dioxo-hexan-2-ol anion
TypeSmall organic molecule
Emp. Form.C24H34BrN2O8
Mol. Mass.558.44
SMILESCC(C)[C@H](C)C(=O)NC(=O)[C@H]([O-])[C@H](O)[C@@H](O)[C@@H](Oc1ccc(Br)cc1)C(=O)NC(=O)[C@@H](C)C(C)C