Reaction Details
TargetGag-Pol polyprotein [489-587]
LigandBDBM50366785
Substrate/Competitorn/a
Meas. Tech.ChEMBL_302776 (CHEMBL838839)
Ki 0.54±n/a nM
Citation Shuman, CFVrang, LDanielson, UH Improved structure-activity relationship analysis of HIV-1 protease inhibitors using interaction kinetic data. J Med Chem47:5953-61 (2004) 
 
Gag-Pol polyprotein [489-587]
Name:Gag-Pol polyprotein [489-587]
Type:Enzyme Subunit
Mol. Mass.:10781.16
Organism:Human immunodeficiency virus type 1
Description:P04585[489-587]
Residue:99
BDBM50366785
NameBDBM50366785
Synonyms:NELFINAVIR
TypeSmall organic molecule
Emp. Form.C32H45N3O4S
Mol. Mass.567.782
SMILESCc1c(O)cccc1C(=O)N[C@H](CSc1ccccc1)[C@H](O)CN1C[C@H]2CCCC[C@H]2C[C@H]1C(=O)NC(C)(C)C