Reaction Details
TargetGag-Pol polyprotein [489-587]
LigandBDBM577
Substrate/Competitorn/a
Meas. Tech.ChEMBL_302776 (CHEMBL838839)
Ki 0.23±n/a nM
Citation Shuman, CFVrang, LDanielson, UH Improved structure-activity relationship analysis of HIV-1 protease inhibitors using interaction kinetic data. J Med Chem47:5953-61 (2004) 
 
Gag-Pol polyprotein [489-587]
Name:Gag-Pol polyprotein [489-587]
Type:Enzyme Subunit
Mol. Mass.:10781.16
Organism:Human immunodeficiency virus type 1
Description:P04585[489-587]
Residue:99
BDBM577
NameBDBM577
Synonyms:(3S)-oxolan-3-yl N-[(2S,3R)-4-[(4-aminobenzene)(2-methylpropyl)sulfonamido]-3-hydroxy-1-phenylbutan-2-yl]carbamate APV Amprenavir CHEMBL116 | VX-478
TypeSmall organic molecule
Emp. Form.C25H35N3O6S
Mol. Mass.505.627
SMILESCC(C)CN(C[C@@H](O)[C@H](Cc1ccccc1)NC(=O)O[C@H]1CCOC1)S(=O)(=O)c1ccc(N)cc1