Reaction Details
TargetGag-Pol polyprotein [489-587]
LigandBDBM50121510
Substrate/Competitorn/a
Meas. Tech.ChEMBL_302776 (CHEMBL838839)
Ki 55±n/a nM
Citation Shuman, CFVrang, LDanielson, UH Improved structure-activity relationship analysis of HIV-1 protease inhibitors using interaction kinetic data. J Med Chem47:5953-61 (2004) 
 
Gag-Pol polyprotein [489-587]
Name:Gag-Pol polyprotein [489-587]
Type:Enzyme Subunit
Mol. Mass.:10781.16
Organism:Human immunodeficiency virus type 1
Description:P04585[489-587]
Residue:99
BDBM50121510
NameBDBM50121510
Synonyms:CHEMBL150908 | N*1*-[1-Benzyl-3-(2-tert-butylcarbamoyl-phenylamino)-2-hydroxy-propyl]-2-[(quinoline-2-carbonyl)-amino]-succinamide
TypeSmall organic molecule
Emp. Form.C35H40N6O5
Mol. Mass.624.7293
SMILESCC(C)(C)NC(=O)c1ccccc1NC[C@H](O)[C@H](Cc1ccccc1)NC(=O)[C@H](CC(N)=O)NC(=O)c1ccc2ccccc2n1