Reaction Details
TargetCytochrome P450 2C9
LigandBDBM12345
Substrate/Competitorn/a
Meas. Tech.ChEMBL_305741 (CHEMBL829413)
IC50 11700±n/a nM
Citation Denton, TTZhang, XCashman, JR 5-substituted, 6-substituted, and unsubstituted 3-heteroaromatic pyridine analogues of nicotine as selective inhibitors of cytochrome P-450 2A6. J Med Chem48:224-39 (2005) 
 
Cytochrome P450 2C9
Name:Cytochrome P450 2C9
Type:Enzyme
Mol. Mass.:55636.33
Organism:Homo sapiens (Human)
Description:P11712
Residue:490
BDBM12345
NameBDBM12345
Synonyms:CHEMBL178090 US8609708, 47 nicotine 3-heteroaromatic analogue 2a
TypeSmall organic molecule
Emp. Form.C10H10N2O
Mol. Mass.174.1992
SMILESNCc1ccc(o1)-c1cccnc1