Reaction Details
TargetCytochrome P450 2E1
LigandBDBM50158925
Substrate/Competitorn/a
Meas. Tech.ChEMBL_305743 (CHEMBL829415)
IC50 860±n/a nM
Citation Denton, TTZhang, XCashman, JR 5-substituted, 6-substituted, and unsubstituted 3-heteroaromatic pyridine analogues of nicotine as selective inhibitors of cytochrome P-450 2A6. J Med Chem48:224-39 (2005) 
 
Cytochrome P450 2E1
Name:Cytochrome P450 2E1
Type:Enzyme
Mol. Mass.:56860.34
Organism:Homo sapiens (Human)
Description:P05181
Residue:493
BDBM50158925
NameBDBM50158925
Synonyms:Bis-(5-pyridin-3-yl-thiophen-2-ylmethyl)-amine | CHEMBL178711
TypeSmall organic molecule
Emp. Form.C20H17N3S2
Mol. Mass.363.499
SMILESC(NCc1ccc(s1)-c1cccnc1)c1ccc(s1)-c1cccnc1