Reaction Details
TargetD(2) dopamine receptor
LigandBDBM50159014
Substrate/Competitorn/a
Meas. Tech.ChEMBL_303180 (CHEMBL829674)
Ki 575±n/a nM
Citation Costantino, LGandolfi, FSorbi, CFranchini, SPrezzavento, OVittorio, FRonsisvalle, GLeonardi, APoggesi, EBrasili, L Synthesis and structure-activity relationships of 1-aralkyl-4-benzylpiperidine and 1-aralkyl-4-benzylpiperazine derivatives as potent sigma ligands. J Med Chem48:266-73 (2005) 
 
D(2) dopamine receptor
Name:D(2) dopamine receptor
Type:G Protein-Coupled Receptor (GPCR)
Mol. Mass.:50931.60
Organism:Rattus norvegicus (rat)
Description:P61169
Residue:444
BDBM50159014
NameBDBM50159014
Synonyms:4-Benzyl-1-indan-2-ylmethyl-piperidine | CHEMBL179145
TypeSmall organic molecule
Emp. Form.C22H27N
Mol. Mass.305.4565
SMILESC(C1Cc2ccccc2C1)N1CCC(Cc2ccccc2)CC1