Reaction Details
TargetD(2) dopamine receptor
LigandBDBM50159024
Substrate/Competitorn/a
Meas. Tech.ChEMBL_302694 (CHEMBL839567)
Ki 3.61±n/a nM
Citation Costantino, LGandolfi, FSorbi, CFranchini, SPrezzavento, OVittorio, FRonsisvalle, GLeonardi, APoggesi, EBrasili, L Synthesis and structure-activity relationships of 1-aralkyl-4-benzylpiperidine and 1-aralkyl-4-benzylpiperazine derivatives as potent sigma ligands. J Med Chem48:266-73 (2005) 
 
D(2) dopamine receptor
Name:D(2) dopamine receptor
Type:G Protein-Coupled Receptor (GPCR)
Mol. Mass.:50931.60
Organism:Rattus norvegicus (rat)
Description:P61169
Residue:444
BDBM50159024
NameBDBM50159024
Synonyms:4-Benzyl-1-chroman-2-ylmethyl-piperidine | CHEMBL178650
TypeSmall organic molecule
Emp. Form.C22H27NO
Mol. Mass.321.4559
SMILESC(C1CCc2ccccc2O1)N1CCC(Cc2ccccc2)CC1