Reaction Details
Target5-hydroxytryptamine receptor 1A
LigandBDBM50159028
Substrate/Competitorn/a
Meas. Tech.ChEMBL_303379 (CHEMBL839696)
Ki 185±n/a nM
Citation Costantino, LGandolfi, FSorbi, CFranchini, SPrezzavento, OVittorio, FRonsisvalle, GLeonardi, APoggesi, EBrasili, L Synthesis and structure-activity relationships of 1-aralkyl-4-benzylpiperidine and 1-aralkyl-4-benzylpiperazine derivatives as potent sigma ligands. J Med Chem48:266-73 (2005) 
 
5-hydroxytryptamine receptor 1A
Name:5-hydroxytryptamine receptor 1A
Type:n/a
Mol. Mass.:46122.49
Organism:Homo sapiens (Human)
Description:n/a
Residue:422
BDBM50159028
NameBDBM50159028
Synonyms:1-Benzyl-4-(1,2,3,4-tetrahydro-naphthalen-2-ylmethyl)-piperazine | CHEMBL369091
TypeSmall organic molecule
Emp. Form.C22H28N2
Mol. Mass.320.4711
SMILESC(C1CCc2ccccc2C1)N1CCN(Cc2ccccc2)CC1