Reaction Details
TargetSigma non-opioid intracellular receptor 1
LigandBDBM50159033
Substrate/Competitorn/a
Meas. Tech.ChEMBL_303294 (CHEMBL827427)
Ki 7.9±n/a nM
Citation Costantino, LGandolfi, FSorbi, CFranchini, SPrezzavento, OVittorio, FRonsisvalle, GLeonardi, APoggesi, EBrasili, L Synthesis and structure-activity relationships of 1-aralkyl-4-benzylpiperidine and 1-aralkyl-4-benzylpiperazine derivatives as potent sigma ligands. J Med Chem48:266-73 (2005) 
 
Sigma non-opioid intracellular receptor 1
Name:Sigma non-opioid intracellular receptor 1
Type:Enzyme Catalytic Domain
Mol. Mass.:25124.85
Organism:Homo sapiens (Human)
Description:Q99720
Residue:223
BDBM50159033
NameBDBM50159033
Synonyms:2-(4-Benzyl-piperidin-1-ylmethyl)-chroman-4-one | CHEMBL179397
TypeSmall organic molecule
Emp. Form.C22H25NO2
Mol. Mass.335.4394
SMILESO=C1CC(CN2CCC(Cc3ccccc3)CC2)Oc2ccccc12