Reaction Details
TargetSigma non-opioid intracellular receptor 1
LigandBDBM50159015
Substrate/Competitorn/a
Meas. Tech.ChEMBL_303199 (CHEMBL829825)
Ki 16.2±n/a nM
Citation Costantino, LGandolfi, FSorbi, CFranchini, SPrezzavento, OVittorio, FRonsisvalle, GLeonardi, APoggesi, EBrasili, L Synthesis and structure-activity relationships of 1-aralkyl-4-benzylpiperidine and 1-aralkyl-4-benzylpiperazine derivatives as potent sigma ligands. J Med Chem48:266-73 (2005) 
 
Sigma non-opioid intracellular receptor 1
Name:Sigma non-opioid intracellular receptor 1
Type:Enzyme Catalytic Domain
Mol. Mass.:25124.85
Organism:Homo sapiens (Human)
Description:Q99720
Residue:223
BDBM50159015
NameBDBM50159015
Synonyms:4-Benzyl-1-(2,3-dihydro-benzo[1,4]dioxin-2-ylmethyl)-piperidine | CHEMBL178700
TypeSmall organic molecule
Emp. Form.C21H25NO2
Mol. Mass.323.4287
SMILESC(C1COc2ccccc2O1)N1CCC(Cc2ccccc2)CC1