Reaction Details
TargetO43924/P16499/P18545/P35913/P51160/Q13956
LigandBDBM14390
Substrate/Competitorn/a
Meas. Tech.ChEMBL_302483 (CHEMBL827174)
Ki 50±n/a nM
Citation Manallack, DTHughes, RAThompson, PE The next generation of phosphodiesterase inhibitors: structural clues to ligand and substrate selectivity of phosphodiesterases. J Med Chem48:3449-62 (2005) 
 
O43924/P16499/P18545/P35913/P51160/Q13956
Name:O43924/P16499/P18545/P35913/P51160/Q13956
Synonyms:Phosphodiesterase 6
Type:n/a
Mol. Mass.:n/a
Description:ASSAY_ID of ChEMBL is 387456
Components:This complex has 6 components.
Component 1
Name:Retinal rod rhodopsin-sensitive cGMP 3',5'-cyclic phosphodiesterase subunit gamma
Type:PROTEIN
Mol. Mass.:9648.05
Organism:Homo sapiens (Human)
Description:ChEMBL_105761
Residue:87
Component 2
Name:Retinal rod rhodopsin-sensitive cGMP 3',5'-cyclic phosphodiesterase subunit delta
Synonyms:3',5'-cyclic phosphodiesterase PDE6D PDED Retinal rod rhodopsin-sensitive cGMP 3',5'-cyclic phosphodiesterase subunit delta
Type:PROTEIN
Mol. Mass.:17418.30
Organism:Homo sapiens (Human)
Description:ChEMBL_105761
Residue:150
Component 3
Name:Cone cGMP-specific 3',5'-cyclic phosphodiesterase subunit alpha'
Synonyms:3',5'-cyclic phosphodiesterase PDE6C_HUMAN Phosphodiesterase 6C | Phosphodiesterase 6C (PDE6C)
Type:Protein
Mol. Mass.:99132.02
Organism:Homo sapiens (Human)
Description:P51160
Residue:858
Component 4
Name:Retinal cone rhodopsin-sensitive cGMP 3',5'-cyclic phosphodiesterase subunit gamma
Synonyms:CNCG_HUMAN PDE6H
Type:PROTEIN
Mol. Mass.:9078.33
Organism:Homo sapiens (Human)
Description:ChEMBL_105761
Residue:83
Component 5
Name:Rod cGMP-specific 3',5'-cyclic phosphodiesterase subunit alpha
Synonyms:PDE6A PDEA | Rod cGMP-specific 3',5'-cyclic phosphodiesterase alpha
Type:PROTEIN
Mol. Mass.:99531.10
Organism:Homo sapiens (Human)
Description:ChEMBL_1347866
Residue:860
Component 6
Name:Rod cGMP-specific 3',5'-cyclic phosphodiesterase subunit beta
Synonyms:GMP-PDE beta PDE6B_HUMAN | PDEB
Type:PROTEIN
Mol. Mass.:98308.48
Organism:Homo sapiens (Human)
Description:ChEMBL_105761
Residue:854
BDBM14390
NameBDBM14390
Synonyms:5-[2-ethoxy-5-(4-methyl-1-piperazinylsulfonyl)phenyl]-1-methyl-3-n-propyl-1,6-dihydro-7H-pyrazolo[4,3-d]pyrimidin-7-one CHEMBL192 Sildenafil US11155558, Compound sildenafil US11897890, Compound sildenafil | Viagra
TypeSmall organic molecule
Emp. Form.C22H30N6O4S
Mol. Mass.474.576
SMILESCCCc1nn(C)c2c1nc([nH]c2=O)-c1cc(ccc1OCC)S(=O)(=O)N1CCN(C)CC1