Reaction Details
TargetD(3) dopamine receptor
LigandBDBM50119380
Substrate/Competitorn/a
Meas. Tech.ChEMBL_303041 (CHEMBL828011)
Ki 0.920±n/a nM
Citation Newman, AHGrundt, PNader, MA Dopamine D3 receptor partial agonists and antagonists as potential drug abuse therapeutic agents. J Med Chem48:3663-79 (2005) 
 
D(3) dopamine receptor
Name:D(3) dopamine receptor
Type:n/a
Mol. Mass.:44243.43
Organism:Homo sapiens (Human)
Description:n/a
Residue:400
BDBM50119380
NameBDBM50119380
Synonyms:CHEMBL25236 N-(4-(4-(2-methoxyphenyl)piperazin-1-yl)butyl)-2-naphthamide | Naphthalene-2-carboxylic acid {4-[4-(2-methoxy-phenyl)-piperazin-1-yl]-butyl}-amide
TypeSmall organic molecule
Emp. Form.C26H31N3O2
Mol. Mass.417.5432
SMILESCOc1ccccc1N1CCN(CCCCNC(=O)c2ccc3ccccc3c2)CC1