Reaction Details
TargetD(4) dopamine receptor
LigandBDBM50167931
Substrate/Competitorn/a
Meas. Tech.ChEMBL_303714 (CHEMBL829049)
Ki 0.52±n/a nM
Citation Schlotter, KBoeckler, FHübner, HGmeiner, P Fancy bioisosteres: metallocene-derived G-protein-coupled receptor ligands with subnanomolar binding affinity and novel selectivity profiles. J Med Chem48:3696-9 (2005) 
 
D(4) dopamine receptor
Name:D(4) dopamine receptor
Type:Enzyme
Mol. Mass.:48373.19
Organism:Homo sapiens (Human)
Description:P21917
Residue:419
BDBM50167931
NameBDBM50167931
Synonyms:CHEMBL364516 | N-{4-[4-(2-methoxyphenyl)piperazin-1-yl]butyl}-1-ferra-1,1'-spirobi[pentacyclo[2.2.0.0^{1,3}.0^{1,5}.0^{2,6}]hexane]-2,2',4,4'-tetraene-6-carboxamide
TypeSmall organic molecule
Emp. Form.C26H25FeN3O2
Mol. Mass.467.341
SMILES[Fe]123456789C%10C1=C2C3=C4%10.N(CCCCN1CCN(CC1)c1c(cccc1)OC)C(C51C6=C7C8=C91)=O