Reaction Details
TargetD(3) dopamine receptor
LigandBDBM50167935
Substrate/Competitorn/a
Meas. Tech.ChEMBL_303702 (CHEMBL829037)
Ki 3.5±n/a nM
Citation Schlotter, KBoeckler, FHübner, HGmeiner, P Fancy bioisosteres: metallocene-derived G-protein-coupled receptor ligands with subnanomolar binding affinity and novel selectivity profiles. J Med Chem48:3696-9 (2005) 
 
D(3) dopamine receptor
Name:D(3) dopamine receptor
Type:n/a
Mol. Mass.:44243.43
Organism:Homo sapiens (Human)
Description:n/a
Residue:400
BDBM50167935
NameBDBM50167935
Synonyms:CHEMBL195083 | N-{4-[4-(3-chloro-2-methoxyphenyl)piperazin-1-yl]butyl}-1-ferra-1,1'-spirobi[pentacyclo[2.2.0.0^{1,3}.0^{1,5}.0^{2,6}]hexane]-2,2',4,4'-tetraene-6-carboxamide
TypeSmall organic molecule
Emp. Form.C26H24ClFeN3O2
Mol. Mass.501.786
SMILESc1(Cl)c(c(N2CCN(CC2)CCCCNC(C23[Fe]456789%10%11C%12C4=C5C6=C7%12)=O)ccc1)OC.C8(C9=C2%10)=C3%11