Reaction Details
TargetCytochrome P450 1A2
LigandBDBM50159250
Substrate/Competitorn/a
Meas. Tech.ChEMBL_305428 (CHEMBL830921)
IC50 17000±n/a nM
Citation Korhonen, LERahnasto, MMähönen, NJWittekindt, CPoso, AJuvonen, RORaunio, H Predictive three-dimensional quantitative structure-activity relationship of cytochrome P450 1A2 inhibitors. J Med Chem48:3808-15 (2005) 
 
Cytochrome P450 1A2
Name:Cytochrome P450 1A2
Type:Enzyme
Mol. Mass.:58423.38
Organism:Homo sapiens (Human)
Description:P05177
Residue:516
BDBM50159250
NameBDBM50159250
Synonyms:2-Naphthol CHEMBL14126 beta-hydroxynaphthalene | naphthalen-2-ol
TypeSmall organic molecule
Emp. Form.C10H8O
Mol. Mass.144.1699
SMILESOc1ccc2ccccc2c1