Reaction Details
TargetTransporter
LigandBDBM50168041
Substrate/Competitorn/a
Meas. Tech.ChEMBL_303548 (CHEMBL839753)
Ki 0.430±n/a nM
Citation Carroll, FITyagi, SBlough, BEKuhar, MJNavarro, HA Synthesis and monoamine transporter binding properties of 3alpha-(substituted phenyl)nortropane-2beta-carboxylic acid methyl esters. Norepinephrine transporter selective compounds. J Med Chem48:3852-7 (2005) 
 
Transporter
Name:Transporter
Type:PROTEIN
Mol. Mass.:66787.87
Organism:Rattus norvegicus
Description:ChEMBL_1463061
Residue:597
BDBM50168041
NameBDBM50168041
Synonyms:3-(3-Fluoro-4-methyl-phenyl)-8-aza-bicyclo[3.2.1]octane-2-carboxylic acid methyl ester | CHEMBL365738
TypeSmall organic molecule
Emp. Form.C16H20FNO2
Mol. Mass.277.3339
SMILESCOC(=O)C1C2CCC(CC1c1ccc(C)c(F)c1)N2