Reaction Details
TargetSodium-dependent serotonin transporter
LigandBDBM50046732
Substrate/Competitorn/a
Meas. Tech.ChEMBL_303285 (CHEMBL828278)
Ki 0.38±n/a nM
Citation Carroll, FITyagi, SBlough, BEKuhar, MJNavarro, HA Synthesis and monoamine transporter binding properties of 3alpha-(substituted phenyl)nortropane-2beta-carboxylic acid methyl esters. Norepinephrine transporter selective compounds. J Med Chem48:3852-7 (2005) 
 
Sodium-dependent serotonin transporter
Name:Sodium-dependent serotonin transporter
Type:Multi-pass membrane protein
Mol. Mass.:70168.43
Organism:Rattus norvegicus (rat)
Description:P31652
Residue:630
BDBM50046732
NameBDBM50046732
Synonyms:(R)-3-(4-Chloro-phenyl)-8-aza-bicyclo[3.2.1]octane-2-carboxylic acid methyl ester 3-(4-Fluoro-phenyl)-8-methyl-8-aza-bicyclo[3.2.1]octane-2-carboxylic acid methyl ester | CHEMBL81525
TypeSmall organic molecule
Emp. Form.C15H18ClNO2
Mol. Mass.279.762
SMILESCOC(=O)C1C2CCC(CC1c1ccc(Cl)cc1)N2