Reaction Details
TargetSolute carrier family 15 member 1
LigandBDBM50169127
Substrate/Competitorn/a
Meas. Tech.ChEMBL_302952 (CHEMBL841787)
Ki 410000±n/a nM
Citation Biegel, AGebauer, SHartrodt, BBrandsch, MNeubert, KThondorf, I Three-dimensional quantitative structure-activity relationship analyses of beta-lactam antibiotics and tripeptides as substrates of the mammalian H+/peptide cotransporter PEPT1. J Med Chem48:4410-9 (2005) 
 
Solute carrier family 15 member 1
Name:Solute carrier family 15 member 1
Type:PROTEIN
Mol. Mass.:78818.07
Organism:Homo sapiens (Human)
Description:ChEMBL_1488839
Residue:708
BDBM50169127
NameBDBM50169127
Synonyms:(S)-2-((S)-2-Amino-3-carboxy-propionylamino)-succinic acid Asp-Asp | CHEMBL17171
TypeSmall organic molecule
Emp. Form.C8H12N2O7
Mol. Mass.248.1901
SMILESN[C@@H](CC(O)=O)C(=O)N[C@@H](CC(O)=O)C(O)=O