Reaction Details
TargetSolute carrier family 15 member 1
LigandBDBM50169141
Substrate/Competitorn/a
Meas. Tech.ChEMBL_302952 (CHEMBL841787)
Ki 1200000±n/a nM
Citation Biegel, AGebauer, SHartrodt, BBrandsch, MNeubert, KThondorf, I Three-dimensional quantitative structure-activity relationship analyses of beta-lactam antibiotics and tripeptides as substrates of the mammalian H+/peptide cotransporter PEPT1. J Med Chem48:4410-9 (2005) 
 
Solute carrier family 15 member 1
Name:Solute carrier family 15 member 1
Type:PROTEIN
Mol. Mass.:78818.07
Organism:Homo sapiens (Human)
Description:ChEMBL_1488839
Residue:708
BDBM50169141
NameBDBM50169141
Synonyms:CHEMBL371194 i(S)-1-((S)-Pyrrolidine-2-carbonyl)-pyrroliidine-2-carboxylic acid
TypeSmall organic molecule
Emp. Form.C10H16N2O3
Mol. Mass.212.2456
SMILESOC(=O)[C@@H]1CCCN1C(=O)[C@@H]1CCCN1