Reaction Details
TargetSolute carrier family 15 member 1
LigandBDBM50169151
Substrate/Competitorn/a
Meas. Tech.ChEMBL_302952 (CHEMBL841787)
Ki 180000±n/a nM
Citation Biegel, AGebauer, SHartrodt, BBrandsch, MNeubert, KThondorf, I Three-dimensional quantitative structure-activity relationship analyses of beta-lactam antibiotics and tripeptides as substrates of the mammalian H+/peptide cotransporter PEPT1. J Med Chem48:4410-9 (2005) 
 
Solute carrier family 15 member 1
Name:Solute carrier family 15 member 1
Type:PROTEIN
Mol. Mass.:78818.07
Organism:Homo sapiens (Human)
Description:ChEMBL_1488839
Residue:708
BDBM50169151
NameBDBM50169151
Synonyms:(S)-1-((S)-2-Amino-4-methyl-pentanoyl)-pyrrolidine-2-carboxylic acid | CHEMBL189210
TypeSmall organic molecule
Emp. Form.C11H20N2O3
Mol. Mass.228.2881
SMILESCC(C)C[C@H](N)C(=O)N1CCC[C@H]1C(O)=O