Reaction Details
TargetSolute carrier family 15 member 1
LigandBDBM50370588
Substrate/Competitorn/a
Meas. Tech.ChEMBL_302952 (CHEMBL841787)
Ki 13000000±n/a nM
Citation Biegel, AGebauer, SHartrodt, BBrandsch, MNeubert, KThondorf, I Three-dimensional quantitative structure-activity relationship analyses of beta-lactam antibiotics and tripeptides as substrates of the mammalian H+/peptide cotransporter PEPT1. J Med Chem48:4410-9 (2005) 
 
Solute carrier family 15 member 1
Name:Solute carrier family 15 member 1
Type:PROTEIN
Mol. Mass.:78818.07
Organism:Homo sapiens (Human)
Description:ChEMBL_1488839
Residue:708
BDBM50370588
NameBDBM50370588
Synonyms:METAMPICILLIN
TypeSmall organic molecule
Emp. Form.C17H19N3O4S
Mol. Mass.361.415
SMILESCC1(C)S[C@@H]2[C@H](NC(=O)[C@H](N=C)c3ccccc3)C(=O)N2[C@H]1C(O)=O