Reaction Details
TargetSolute carrier family 15 member 1
LigandBDBM50169159
Substrate/Competitorn/a
Meas. Tech.ChEMBL_302952 (CHEMBL841787)
Ki 7000000±n/a nM
Citation Biegel, AGebauer, SHartrodt, BBrandsch, MNeubert, KThondorf, I Three-dimensional quantitative structure-activity relationship analyses of beta-lactam antibiotics and tripeptides as substrates of the mammalian H+/peptide cotransporter PEPT1. J Med Chem48:4410-9 (2005) 
 
Solute carrier family 15 member 1
Name:Solute carrier family 15 member 1
Type:PROTEIN
Mol. Mass.:78818.07
Organism:Homo sapiens (Human)
Description:ChEMBL_1488839
Residue:708
BDBM50169159
NameBDBM50169159
Synonyms:2-((R)-2-Amino-3-phenyl-propionylamino)-propionic acid | CHEMBL192667
TypeSmall organic molecule
Emp. Form.C12H16N2O3
Mol. Mass.236.267
SMILESCC(NC(=O)[C@H](N)Cc1ccccc1)C(O)=O