Reaction Details
TargetSolute carrier family 15 member 1
LigandBDBM50169192
Substrate/Competitorn/a
Meas. Tech.ChEMBL_302952 (CHEMBL841787)
Ki 180000±n/a nM
Citation Biegel, AGebauer, SHartrodt, BBrandsch, MNeubert, KThondorf, I Three-dimensional quantitative structure-activity relationship analyses of beta-lactam antibiotics and tripeptides as substrates of the mammalian H+/peptide cotransporter PEPT1. J Med Chem48:4410-9 (2005) 
 
Solute carrier family 15 member 1
Name:Solute carrier family 15 member 1
Type:PROTEIN
Mol. Mass.:78818.07
Organism:Homo sapiens (Human)
Description:ChEMBL_1488839
Residue:708
BDBM50169192
NameBDBM50169192
Synonyms:(S)-2-[(S)-2-((S)-2-Amino-propionylamino)-propionylamino]-propionic acid | CHEMBL189368
TypeSmall organic molecule
Emp. Form.C9H17N3O4
Mol. Mass.231.249
SMILESC[C@H](N)C(=O)N[C@@H](C)C(=O)N[C@@H](C)C(O)=O