Reaction Details
TargetSolute carrier family 15 member 1
LigandBDBM50169199
Substrate/Competitorn/a
Meas. Tech.ChEMBL_302952 (CHEMBL841787)
Ki 1000000±n/a nM
Citation Biegel, AGebauer, SHartrodt, BBrandsch, MNeubert, KThondorf, I Three-dimensional quantitative structure-activity relationship analyses of beta-lactam antibiotics and tripeptides as substrates of the mammalian H+/peptide cotransporter PEPT1. J Med Chem48:4410-9 (2005) 
 
Solute carrier family 15 member 1
Name:Solute carrier family 15 member 1
Type:PROTEIN
Mol. Mass.:78818.07
Organism:Homo sapiens (Human)
Description:ChEMBL_1488839
Residue:708
BDBM50169199
NameBDBM50169199
Synonyms:(S)-2-(2-Amino-acetylamino)-3-(3H-imidazol-4-yl)-propionic acid CHEMBL93127 | Gly-His
TypeSmall organic molecule
Emp. Form.C8H12N4O3
Mol. Mass.212.2059
SMILESNCC(=O)N[C@@H](Cc1cnc[nH]1)C(O)=O