Reaction Details
TargetSolute carrier family 15 member 1
LigandBDBM50169203
Substrate/Competitorn/a
Meas. Tech.ChEMBL_302952 (CHEMBL841787)
Ki 20000±n/a nM
Citation Biegel, AGebauer, SHartrodt, BBrandsch, MNeubert, KThondorf, I Three-dimensional quantitative structure-activity relationship analyses of beta-lactam antibiotics and tripeptides as substrates of the mammalian H+/peptide cotransporter PEPT1. J Med Chem48:4410-9 (2005) 
 
Solute carrier family 15 member 1
Name:Solute carrier family 15 member 1
Type:PROTEIN
Mol. Mass.:78818.07
Organism:Homo sapiens (Human)
Description:ChEMBL_1488839
Residue:708
BDBM50169203
NameBDBM50169203
Synonyms:(S)-2-(2-Benzylamino-3-phenyl-propionylamino)-propionic acid | CHEMBL190174
TypeSmall organic molecule
Emp. Form.C19H22N2O3
Mol. Mass.326.3896
SMILESC[C@H](NC(=O)C(Cc1ccccc1)NCc1ccccc1)C(O)=O