Reaction Details
TargetSolute carrier family 15 member 1
LigandBDBM50169202
Substrate/Competitorn/a
Meas. Tech.ChEMBL_302952 (CHEMBL841787)
Ki 200000±n/a nM
Citation Biegel, AGebauer, SHartrodt, BBrandsch, MNeubert, KThondorf, I Three-dimensional quantitative structure-activity relationship analyses of beta-lactam antibiotics and tripeptides as substrates of the mammalian H+/peptide cotransporter PEPT1. J Med Chem48:4410-9 (2005) 
 
Solute carrier family 15 member 1
Name:Solute carrier family 15 member 1
Type:PROTEIN
Mol. Mass.:78818.07
Organism:Homo sapiens (Human)
Description:ChEMBL_1488839
Residue:708
BDBM50169202
NameBDBM50169202
Synonyms:(S)-4-Amino-4-{(S)-1-[(S)-1-carboxy-2-(4-hydroxy-phenyl)-ethylcarbamoyl]-2-phenyl-ethylcarbamoyl}-butyric acid | CHEMBL363341
TypeSmall organic molecule
Emp. Form.C23H27N3O7
Mol. Mass.457.4764
SMILESN[C@@H](CCC(O)=O)C(=O)N[C@@H](Cc1ccccc1)C(=O)N[C@@H](Cc1ccc(O)cc1)C(O)=O