Reaction Details
TargetSolute carrier family 15 member 1
LigandBDBM50169204
Substrate/Competitorn/a
Meas. Tech.ChEMBL_302952 (CHEMBL841787)
Ki 2700000±n/a nM
Citation Biegel, AGebauer, SHartrodt, BBrandsch, MNeubert, KThondorf, I Three-dimensional quantitative structure-activity relationship analyses of beta-lactam antibiotics and tripeptides as substrates of the mammalian H+/peptide cotransporter PEPT1. J Med Chem48:4410-9 (2005) 
 
Solute carrier family 15 member 1
Name:Solute carrier family 15 member 1
Type:PROTEIN
Mol. Mass.:78818.07
Organism:Homo sapiens (Human)
Description:ChEMBL_1488839
Residue:708
BDBM50169204
NameBDBM50169204
Synonyms:3-(2-Amino-propionylamino)-propionic acid CHEMBL186269
TypeSmall organic molecule
Emp. Form.C6H12N2O3
Mol. Mass.160.1711
SMILESCC(N)C(=O)NCCC(O)=O