Reaction Details
TargetMitogen-activated protein kinase 9
LigandBDBM50169959
Substrate/Competitorn/a
Meas. Tech.ChEMBL_305025 (CHEMBL829459)
IC50 220±n/a nM
Citation Gaillard, PJeanclaude-Etter, IArdissone, VArkinstall, SCambet, YCamps, MChabert, CChurch, DCirillo, RGretener, DHalazy, SNichols, ASzyndralewiez, CVitte, PAGotteland, JP Design and synthesis of the first generation of novel potent, selective, and in vivo active (benzothiazol-2-yl)acetonitrile inhibitors of the c-Jun N-terminal kinase. J Med Chem48:4596-607 (2005) 
 
Mitogen-activated protein kinase 9
Name:Mitogen-activated protein kinase 9
Type:Enzyme
Mol. Mass.:48131.49
Organism:Homo sapiens (Human)
Description:JNK-2 was purchased from Upstate Cell Signaling Solutions (formerly Upstate Biotechnology).
Residue:424
BDBM50169959
NameBDBM50169959
Synonyms:2-(benzo[d]thiazol-2(3H)-ylidene)-2-(2-(2-(pyridin-3-yl)ethylamino)pyrimidin-4-yl)acetonitrile AS601245 CHEMBL191384 | [3H-Benzothiazol-(2Z)-ylidene]-[2-(2-pyridin-3-yl-ethylamino)-pyrimidin-4-yl]-acetonitrile
TypeSmall organic molecule
Emp. Form.C20H16N6S
Mol. Mass.372.446
SMILESN#CC(c1nc2ccccc2s1)c1ccnc(NCCc2cccnc2)n1