Reaction Details
TargetMitogen-activated protein kinase 10
LigandBDBM50169973
Substrate/Competitorn/a
Meas. Tech.ChEMBL_304976 (CHEMBL829309)
IC50>5000±n/a nM
Citation Gaillard, PJeanclaude-Etter, IArdissone, VArkinstall, SCambet, YCamps, MChabert, CChurch, DCirillo, RGretener, DHalazy, SNichols, ASzyndralewiez, CVitte, PAGotteland, JP Design and synthesis of the first generation of novel potent, selective, and in vivo active (benzothiazol-2-yl)acetonitrile inhibitors of the c-Jun N-terminal kinase. J Med Chem48:4596-607 (2005) 
 
Mitogen-activated protein kinase 10
Name:Mitogen-activated protein kinase 10
Type:PROTEIN
Mol. Mass.:52534.34
Organism:Rattus norvegicus
Description:ChEMBL_1460661
Residue:464
BDBM50169973
NameBDBM50169973
Synonyms:CHEMBL190591 | [3H-Benzothiazol-(2Z)-ylidene]-(2-dipropylamino-pyrimidin-4-yl)-acetonitrile
TypeSmall organic molecule
Emp. Form.C19H21N5S
Mol. Mass.351.469
SMILESCCCN(CCC)c1nccc(n1)C(C#N)c1nc2ccccc2s1