Reaction Details
TargetMitogen-activated protein kinase 10
LigandBDBM50170014
Substrate/Competitorn/a
Meas. Tech.ChEMBL_304976 (CHEMBL829309)
IC50 350±n/a nM
Citation Gaillard, PJeanclaude-Etter, IArdissone, VArkinstall, SCambet, YCamps, MChabert, CChurch, DCirillo, RGretener, DHalazy, SNichols, ASzyndralewiez, CVitte, PAGotteland, JP Design and synthesis of the first generation of novel potent, selective, and in vivo active (benzothiazol-2-yl)acetonitrile inhibitors of the c-Jun N-terminal kinase. J Med Chem48:4596-607 (2005) 
 
Mitogen-activated protein kinase 10
Name:Mitogen-activated protein kinase 10
Type:PROTEIN
Mol. Mass.:52534.34
Organism:Rattus norvegicus
Description:ChEMBL_1460661
Residue:464
BDBM50170014
NameBDBM50170014
Synonyms:(2Z)-1,3-benzothiazol-2(3H)-ylidene(6-bromo-2-chloropyrimidin-4-yl)acetonitrile | CHEMBL425902
TypeSmall organic molecule
Emp. Form.C13H6BrClN4S
Mol. Mass.365.636
SMILESClc1nc(Br)cc(n1)C(C#N)c1nc2ccccc2s1