Reaction Details
TargetS-methyl-5'-thioadenosine phosphorylase
LigandBDBM50170095
Substrate/Competitorn/a
Meas. Tech.ChEMBL_303908 (CHEMBL828333)
Ki 0.12±n/a nM
Citation Evans, GBFurneaux, RHLenz, DHPainter, GFSchramm, VLSingh, VTyler, PC Second generation transition state analogue inhibitors of human 5'-methylthioadenosine phosphorylase. J Med Chem48:4679-89 (2005) 
 
S-methyl-5'-thioadenosine phosphorylase
Name:S-methyl-5'-thioadenosine phosphorylase
Type:Enzyme
Mol. Mass.:31239.23
Organism:Homo sapiens (Human)
Description:n/a
Residue:283
BDBM50170095
NameBDBM50170095
Synonyms:1-(4-Amino-4,5-dihydro-3H-pyrrolo[3,2-d]pyrimidin-7-ylmethyl)-4-propylsulfanylmethyl-pyrrolidin-3-ol | CHEMBL425188
TypeSmall organic molecule
Emp. Form.C15H25N5OS
Mol. Mass.323.457
SMILESCCCSCC1CN(Cc2c[nH]c3C(N)NC=Nc23)CC1O