Reaction Details
TargetNeuronal acetylcholine receptor subunit alpha-3/beta-2
LigandBDBM50170592
Substrate/Competitorn/a
Meas. Tech.ChEMBL_306276 (CHEMBL827553)
IC50 1.5±n/a nM
Citation Jensen, AAFrølund, BLiljefors, TKrogsgaard-Larsen, P Neuronal nicotinic acetylcholine receptors: structural revelations, target identifications, and therapeutic inspirations. J Med Chem48:4705-45 (2005) 
 
Neuronal acetylcholine receptor subunit alpha-3/beta-2
Name:Neuronal acetylcholine receptor subunit alpha-3/beta-2
Type:n/a
Mol. Mass.:n/a
Description:ASSAY_ID of EBI is 143246
Components:This complex has 2 components.
Component 1
Name:Neuronal acetylcholine receptor subunit beta-2
Synonyms:ACHB2_HUMAN Neuronal acetylcholine receptor protein beta-2 subunit | Nicotinic acetylcholine receptor alpha3/beta2/alpha5
Type:Protein
Mol. Mass.:57020.50
Organism:Homo sapiens (Human)
Description:P17787
Residue:502
Component 2
Name:Neuronal acetylcholine receptor subunit alpha-3
Synonyms:ACHA3_HUMAN Cholinergic, Nicotinic Alpha3Beta2 Cholinergic, Nicotinic Alpha3Beta4x NACHRA3 Neuronal acetylcholine receptor subunit alpha-3 nicotinic central
Type:Enzyme Catalytic Domain
Mol. Mass.:57479.03
Organism:Homo sapiens (Human)
Description:Cholinergic, Nicotinic Alpha3Beta2 0 HUMAN::P32297
Residue:505
BDBM50170592
NameBDBM50170592
Synonyms:CHEMBL411146
TypeSmall organic molecule
Emp. Form.C74H124N26O20S4
Mol. Mass.1826.199
SMILESCC(C)C[C@H](NC(=O)[C@@H](NC(=O)[C@H](C)NC(=O)[C@H](CS)NC(=O)[C@@H]1CCCN1C(=O)[C@@H]1CCCN1C(=O)[C@@H](NC(=O)[C@H](CO)NC(=O)[C@H](CS)NC(=O)[C@H](CS)NC(=O)CN)[C@@H](C)O)C(C)C)C(=O)N[C@@H](Cc1ccc(O)cc1)C(=O)N[C@@H](CS)C(=O)NCC(=O)N[C@@H](CCCNC(N)=N)C(=O)N[C@@H](CCCNC(N)=N)C(=O)N[C@@H](CCCNC(N)=N)C=O